Syntax Error On Token Void Expected

Hi, dear developers and readers! If you are interested in Open Source and are considering to join the community of Open Source developers, it is possible that in this list you will find the project.

Bully Scholar Ship Edition Pc Graphics Mod Microsoft isn’t having the best software performance, but has the most powerful home console on the market. High-quality PC games are arriving in waves and dominating gaming discussions. Sony is. It’s a weird thing to ask for this specifically, sure, and there’s a good chance that the hypothetical Bully 2 might have a hypothetical photo
Higher Education Magazines And Journals Some education-related magazines provide archived issues of their publications. Periodicals Index Online (1665 – 1995)(use to locate journals and journal. Educational Leadership magazine is ASCD's flagship publication. With a. and the latest trends and issues affecting prekindergarten through higher education. WICHE (Western Interstate Commission for Higher Education) is a regional, nonprofit organization. Membership includes the
Philosopher By Eternal Fool Asley Pdf Nevertheless, Buffett’s straightforward, patient investment philosophy represents a much better model for. By contrast, Warren Buffett is an eternal optimist. In his recent 2016 Berkshire Hathaway. Developing countries spent more on renewable power than rich ones for the first time last year, driving the fastest increase in sources of green energy on record, a study

void setX(double x) { xVal = x. The constructor passes the center parameter to the base class’s constructor using a special syntax between the function signature and the function body. In the body,

o:ics3u1cpptasks_jonathanyoungtextbaserpgmain.cpp(192): error C2143: syntax error : missing ‘;’ before ‘]’ NOTE: this error occurs from lines 184 to 198. NOTE: this is only one function of about.

Java uses the extends keyword instead of the : token. error. 1. import java.util.*; 2. 3. /** 4. * This program demonstrates inheritance. 5. * @version 1.21 2004-02-21 6. * @author Cay Horstmann 7.

I’m getting the error message "Error: expected initializer before ‘sum’ " from line 9 of my code when I try to compile my program. I can’t seem to figure out why it would be throwing this error. Any.

If you supply too many, too few, or incorrectly typed parameters, you will get a compile time error. Of course. I only work with the single token I expect to be provided, but you should know that.

Free Middleschool Writing Curricula Innovative Narrative & Creative Writing Curricula for In School Hours Inspiring Project-Based. Click to View Sample: Middle School Grade 6 CCSS. Email us at. After listening to feedback from teachers and staff, de Mendez mentioned that the district is going to provide supplemental reading and writing. of the curriculum.” The acting superintendent also. Philosopher By

error: expected `,’ or `;’ before ‘{‘ token Execution terminated Here they are. I am really confused about the queue being undeclared. So as the linked list and the if stream.

In these cases, using local type inference results in an error being thrown by the compiler in C#. partial class Employee { partial void SalaryChanged() { double newSalary = this.Salary; //do.

expected constructor, destructor, or type conversion before ‘;’ token player.cpp:26: error: ‘TicTacToe’ has not been declared player.cpp: In member function ‘void Player::NextMove(int)’: player.cpp:35.

It provides such features as syntax highlighting, code folding. So you can move on to the errors you find most interesting. The error is easy to see: one string variable is checked twice for ‘null’.

Utpa Social And Behavioral Sciences The School of Social and Behavioral Sciences at the University of Massachusetts held a panel discussion on Wednesday night on the spread of disinformation and “fake news” through social media both. Higher Education Magazines And Journals Some education-related magazines provide archived issues of their publications. Periodicals Index Online (1665 – 1995)(use to locate journals and

public static void DisplayResults. or struct 86 12 DateApp2 Error 15 Expected class, delegate, enum, interface, or struct 91 12 DateApp2 Error 16 Expected class, delegate, enum, interface, or.

This is my encyription and decyrption program. However there some mistakes that ı could not solve them. And ı set everything but when ı press q, my program should quit, ı tried some things but it is.

I am getting a syntax error when I try to compile. Pointer to rear of queue QueueNode<SomeType>* frontPtr; // Pointer to front of queue void PrintNext(QueueNode<SomeType>* tempPtr) const; // Print.

expected unqualified-id before ‘)’ token 34: error: `void Cruise::readInformation()’ and `void Cruise::readInformation()’ cannot be overloaded 43: error: expected `}’ at end of input 43: error:.

If you read the error message it actually tells you what the problem is. System.Data.OleDb.OleDbException: Too few parameters. Expected 4 It is expecting. web.config that points to the DB (and did.

function declaration void computeProduct. when trying to compile: a. expected primary expression before ‘*’ token. b. expected primary expression before "int". both errors point to the function.

It indicates that a computation is long-running, or may not be expected to terminate. Programmatically, the Async type is defined as follows: In other words, a value of type Async<‘a> is a function.